Reaction Details
TargetTyrosine-protein kinase CSK
LigandBDBM92632
Substrate/Competitorn/a
Meas. Tech.Kinase Assay
IC50 4e+3±n/a nM
Citation Geissler, JFTraxler, PRegenass, UMurray, BJRoesel, JLMeyer, TMcGlynn, EStorni, ALydon, NB Thiazolidine-diones. Biochemical and biological activity of a novel class of tyrosine protein kinase inhibitors. J Biol Chem265:22255-61 (1990) Tyrosine-protein kinase CSK
Name:Tyrosine-protein kinase CSK
Type:Tyrosine-protein kinase
Mol. Mass.:50707.30
Organism:Homo sapiens (Human)
Description:P41240
Residue:450
BDBM92632
NameBDBM92632
Synonyms:Thiazolidine-dione, 1
TypeSmall molecule
Emp. Form.C11H12N4O2S2
Mol. Mass.296.369
SMILESCn1c(O)csc1=NN=C1SC(=C)C(=O)N1CC=C