Reaction Details
TargetHistone-lysine N-methyltransferase, H3 lysine-79 specific
LigandBDBM92649
Substrate/Competitorn/a
Meas. Tech.Enzyme Assay
Ki 0.3±0.0 nM
Kd 0.10±0.02 nM
Citation Basavapathruni, AJin, LDaigle, SRMajer, CRTherkelsen, CAWigle, TJKuntz, KWChesworth, RPollock, RMScott, MPMoyer, MPRichon, VMCopeland, RAOlhava, EJ Conformational Adaptation Drives Potent, Selective and Durable Inhibition of the Human Protein Methyltransferase DOT1L. Chem Biol Drug Des80:971-80 (2012) 
 
Histone-lysine N-methyltransferase, H3 lysine-79 specific
Name:Histone-lysine N-methyltransferase, H3 lysine-79 specific
Type:Protein
Mol. Mass.:184911.91
Organism:Homo sapiens (Human)
Description:Q8TEK3
Residue:1537
BDBM92649
NameBDBM92649
Synonyms:EPZ004777
TypeOrganic molecule
Emp. Form.C28H41N7O4
Mol. Mass.539.6696
SMILESCC(C)N(CCCNC(=O)Nc1ccc(cc1)C(C)(C)C)CC1OC([C@H](O)[C@@H]1O)n1ccc2c(N)ncnc12