Reaction Details
TargetProtein kinase C alpha type
LigandBDBM92673
Substrate/Competitorn/a
Meas. Tech.Enzyme Assay
pH7.4±0
Temperature303.15±0 K
IC50>1.000e+6±n/a nM
Citation Chijiwa, THagiwara, MHidaka, H A newly synthesized selective casein kinase I inhibitor, N-(2-aminoethyl)-5-chloroisoquinoline-8-sulfonamide, and affinity purification of casein kinase I from bovine testis. J Biol Chem264:4924-7 (1989) Protein kinase C alpha type
Name:Protein kinase C alpha type
Type:Enzyme
Mol. Mass.:76755.65
Organism:Homo sapiens (Human)
Description:The recombinant human PKC enzymes were produced using a baculovirus expression system in SF9 cells
Residue:672
BDBM92673
NameBDBM92673
Synonyms:Isoquinolinesulfonamide, CKI-6
TypeSmall molecule
Emp. Form.C11H13N3O2S
Mol. Mass.251.305
SMILESNCCNS(=O)(=O)c1cccc2ccncc12