Reaction Details
TargetcAMP-dependent protein kinase type I-alpha regulatory subunit
LigandBDBM92673
Substrate/Competitorn/a
Meas. Tech.Enzyme Assay
pH7.4±0
Temperature303.15±0 K
IC50>1.000e+6±n/a nM
Citation Chijiwa, THagiwara, MHidaka, H A newly synthesized selective casein kinase I inhibitor, N-(2-aminoethyl)-5-chloroisoquinoline-8-sulfonamide, and affinity purification of casein kinase I from bovine testis. J Biol Chem264:4924-7 (1989) cAMP-dependent protein kinase type I-alpha regulatory subunit
Name:cAMP-dependent protein kinase type I-alpha regulatory subunit
Type:Enzyme Catalytic Domain
Mol. Mass.:42885.14
Organism:Bos taurus
Description:gi_115496662
Residue:380
BDBM92673
NameBDBM92673
Synonyms:Isoquinolinesulfonamide, CKI-6
TypeSmall molecule
Emp. Form.C11H13N3O2S
Mol. Mass.251.305
SMILESNCCNS(=O)(=O)c1cccc2ccncc12