Reaction Details
TargetCalcium/calmodulin-dependent protein kinase II inhibitor 2
LigandBDBM92674
Substrate/Competitorn/a
Meas. Tech.Enzyme Assay
pH7.4±0
Temperature303.15±0 K
IC50 1.95e+5±n/a nM
Citation Chijiwa, THagiwara, MHidaka, H A newly synthesized selective casein kinase I inhibitor, N-(2-aminoethyl)-5-chloroisoquinoline-8-sulfonamide, and affinity purification of casein kinase I from bovine testis. J Biol Chem264:4924-7 (1989) Calcium/calmodulin-dependent protein kinase II inhibitor 2
Name:Calcium/calmodulin-dependent protein kinase II inhibitor 2
Type:Protein
Mol. Mass.:8656.67
Organism:Bos taurus (Bovine)
Description:A5D7T0
Residue:79
BDBM92674
NameBDBM92674
Synonyms:Isoquinolinesulfonamide, CKI-7
TypeSmall molecule
Emp. Form.C11H12ClN3O2S
Mol. Mass.285.75
SMILESNCCNS(=O)(=O)c1ccc(Cl)c2ccncc12