Reaction Details
TargetProlyl 4-hydroxylase subunit alpha-1
LigandBDBM52946
Substrate/Competitorn/a
Meas. Tech.Inhibition Assay
Ki 9000±0.0 nM
Citation Majamaa, KGünzler, VHanauske-Abel, HMMyllylä, RKivirikko, KI Partial identity of the 2-oxoglutarate and ascorbate binding sites of prolyl 4-hydroxylase. J Biol Chem261:7819-23 (1986) Prolyl 4-hydroxylase subunit alpha-1
Name:Prolyl 4-hydroxylase subunit alpha-1
Type:Protein
Mol. Mass.:59433.79
Organism:Gallus gallus (Chicken)
Description:P16924
Residue:516
BDBM52946
NameBDBM52946
Synonyms:2-(3,4-dihydroxyphenyl)acetic acid 3,4-Dihydroxyphenylacetate, XV MLS001056737 cid_547
TypeSmall organic molecule
Emp. Form.C8H8O4
Mol. Mass.168.1467
SMILESOC(=O)Cc1ccc(O)c(O)c1