Reaction Details
TargetProlyl 4-hydroxylase subunit alpha-1
LigandBDBM41957
Substrate/Competitorn/a
Meas. Tech.Inhibition Assay
Ki 13000±0.0 nM
Citation Majamaa, KGünzler, VHanauske-Abel, HMMyllylä, RKivirikko, KI Partial identity of the 2-oxoglutarate and ascorbate binding sites of prolyl 4-hydroxylase. J Biol Chem261:7819-23 (1986) Prolyl 4-hydroxylase subunit alpha-1
Name:Prolyl 4-hydroxylase subunit alpha-1
Type:Protein
Mol. Mass.:59433.79
Organism:Gallus gallus (Chicken)
Description:P16924
Residue:516
BDBM41957
NameBDBM41957
Synonyms:3-(3,4-dihydroxyphenyl)propanoic acid 3-[3,4-bis(oxidanyl)phenyl]propanoic acid | cid_348154
TypeSmall organic molecule
Emp. Form.C9H10O4
Mol. Mass.182.1733
SMILESOC(=O)CCc1ccc(O)c(O)c1