Reaction Details
TargetProlyl 4-hydroxylase subunit alpha-1
LigandBDBM92715
Substrate/Competitorn/a
Meas. Tech.Inhibition Assay
Ki>20000000±0.0 nM
Citation Majamaa, KGünzler, VHanauske-Abel, HMMyllylä, RKivirikko, KI Partial identity of the 2-oxoglutarate and ascorbate binding sites of prolyl 4-hydroxylase. J Biol Chem261:7819-23 (1986) Prolyl 4-hydroxylase subunit alpha-1
Name:Prolyl 4-hydroxylase subunit alpha-1
Type:Protein
Mol. Mass.:59433.79
Organism:Gallus gallus (Chicken)
Description:P16924
Residue:516
BDBM92715
NameBDBM92715
Synonyms:(+)-Mandelate, XXI | (-)-Mandelate, XX
TypeSmall molecule
Emp. Form.C8H8O3
Mol. Mass.152.1473
SMILESOC(C(O)=O)c1ccccc1