Reaction Details
TargetAcyl-protein thioesterase 1
LigandBDBM92718
Substrate/Competitorn/a
Meas. Tech.Enzymatic Protein Activity Assay
IC50 1.4e+3± 1e+2 nM
Citation Zimmermann, TJBürger, MTashiro, EKondoh, YMartinez, NEGörmer, KRosin-Steiner, SShimizu, TOzaki, SMikoshiba, KWatanabe, NHall, DVetter, IROsada, HHedberg, CWaldmann, H Boron-based inhibitors of acyl protein thioesterases 1 and 2. Chembiochem14:115-22 (2013) 
 
Acyl-protein thioesterase 1
Name:Acyl-protein thioesterase 1
Type:Protein
Mol. Mass.:24670.33
Organism:Homo sapiens (Human)
Description:O75608
Residue:230
BDBM92718
NameBDBM92718
Synonyms:Phenylboronic acid, 10
TypeSmall molecule
Emp. Form.C6H6BClO2
Mol. Mass.156.375
SMILESOB(O)c1cccc(Cl)c1