Reaction Details
TargetAcyl-protein thioesterase 1
LigandBDBM26139
Substrate/Competitorn/a
Meas. Tech.Enzymatic Protein Activity Assay
IC50 2.3e+3± 1e+2 nM
Citation Zimmermann, TJBürger, MTashiro, EKondoh, YMartinez, NEGörmer, KRosin-Steiner, SShimizu, TOzaki, SMikoshiba, KWatanabe, NHall, DVetter, IROsada, HHedberg, CWaldmann, H Boron-based inhibitors of acyl protein thioesterases 1 and 2. Chembiochem14:115-22 (2013) 
 
Acyl-protein thioesterase 1
Name:Acyl-protein thioesterase 1
Type:Protein
Mol. Mass.:24670.33
Organism:Homo sapiens (Human)
Description:O75608
Residue:230
BDBM26139
NameBDBM26139
Synonyms:1-benzothiophen-2-ylboranediol CHEMBL34964 | Phenylboronic acid, 11
Typen/a
Emp. Form.C8H7BO2S
Mol. Mass.178.016
SMILESOB(O)c1cc2ccccc2s1