Reaction Details
TargetAcyl-protein thioesterase 1
LigandBDBM26140
Substrate/Competitorn/a
Meas. Tech.Enzymatic Protein Activity Assay
IC50 1.35e+4± 1.4e+3 nM
Citation Zimmermann, TJBürger, MTashiro, EKondoh, YMartinez, NEGörmer, KRosin-Steiner, SShimizu, TOzaki, SMikoshiba, KWatanabe, NHall, DVetter, IROsada, HHedberg, CWaldmann, H Boron-based inhibitors of acyl protein thioesterases 1 and 2. Chembiochem14:115-22 (2013) 
 
Acyl-protein thioesterase 1
Name:Acyl-protein thioesterase 1
Type:Protein
Mol. Mass.:24670.33
Organism:Homo sapiens (Human)
Description:O75608
Residue:230
BDBM26140
NameBDBM26140
Synonyms:1-benzofuran-2-ylboranediol CHEMBL143399 | Phenylboronic acid, 21
TypeSmall organic molecule
Emp. Form.C8H7BO3
Mol. Mass.161.95
SMILESOB(O)c1cc2ccccc2o1