Reaction Details
TargetAcetylcholinesterase
LigandBDBM50100134
Substrate/Competitorn/a
Meas. Tech.Inhibition Assay
Ki 4.99e+3± 1.3e+2 nM
Citation Macdonald, IRMartin, ERosenberry, TLDarvesh, S Probing the peripheral site of human butyrylcholinesterase. Biochemistry51:7046-53 (2012) 
 
Acetylcholinesterase
Name:Acetylcholinesterase
Type:Enzyme
Mol. Mass.:67792.70
Organism:Homo sapiens (Human)
Description:P22303
Residue:614
BDBM50100134
NameBDBM50100134
Synonyms:2-(4-Dimethylamino-phenyl)-3,6-dimethyl-benzothiazol-3-ium 2-[4-(dimethylamino)phenyl]-3,6-dimethyl-1,3-benzothiazol-3-ium CHEMBL57267 Thioflavin T, 1 cid_16954
TypeSmall organic molecule
Emp. Form.C17H19N2S
Mol. Mass.283.411
SMILESCN(C)c1ccc(cc1)-c1sc2cc(C)ccc2[n+]1C