Reaction Details
TargetAcetylcholinesterase
LigandBDBM31904
Substrate/Competitorn/a
Meas. Tech.Inhibition Assay
Ki 9.73e+3± 4e+1 nM
Citation Macdonald, IRMartin, ERosenberry, TLDarvesh, S Probing the peripheral site of human butyrylcholinesterase. Biochemistry51:7046-53 (2012) 
 
Acetylcholinesterase
Name:Acetylcholinesterase
Type:Enzyme
Mol. Mass.:67792.70
Organism:Homo sapiens (Human)
Description:P22303
Residue:614
BDBM31904
NameBDBM31904
Synonyms:CHEMBL345124 Propidium Iodide, 2 | propidium iodide
TypeSmall organic molecule
Emp. Form.C27H34N4
Mol. Mass.414.5846
SMILESCC[N+](C)(CC)CCCn1c(-c2ccccc2)c2cc(N)ccc2c2ccc(=[NH2+])cc12