Reaction Details
TargetCholinesterase
LigandBDBM50308418
Substrate/Competitorn/a
Meas. Tech.Inhibition Assay
Ki 21± 4 nM
Citation Macdonald, IRMartin, ERosenberry, TLDarvesh, S Probing the peripheral site of human butyrylcholinesterase. Biochemistry51:7046-53 (2012) 
 
Cholinesterase
Name:Cholinesterase
Type:Homotetramer
Mol. Mass.:68422.27
Organism:Homo sapiens (Human)
Description:P06276
Residue:602
BDBM50308418
NameBDBM50308418
Synonyms:CHEMBL605824 N-[2-(N',N'-Diisopropylamino)ethyl]-1'Hphenothiazine-1'-carboxamide
TypeSmall organic molecule
Emp. Form.C21H27N3OS
Mol. Mass.369.524
SMILESCC(C)N(CCNC(=O)N1c2ccccc2Sc2ccccc12)C(C)C