Reaction Details
TargetPeptide deformylase
LigandBDBM92761
Substrate/Competitorn/a
Meas. Tech.Binding Assay
Ki 117±0.0 nM
Citation Totoritis, RDuraiswami, CTaylor, ANKerrigan, JJCampobasso, NSmith, KJWard, PKing, BWMurrayz-Thompson, MJones, ADVan Aller, GSAubart, KMZalacain, MThrall, SHMeek, TDSchwartz, B Understanding the origins of time-dependent inhibition by polypeptide deformylase inhibitors. Biochemistry50:6642-54 (2011) 
 
Peptide deformylase
Name:Peptide deformylase
Type:Enzyme
Mol. Mass.:22684.24
Organism:Streptococcus pneumoniae (strain ATCC BAA-255 / R6)
Description:The pdf gene from S. pneumoniae was cloned and protein was expressed and purified from E. coli BL21(DE3).
Residue:203
BDBM92761
NameBDBM92761
Synonyms:PDF inhibitor, compound 3
TypeSmall molecule
Emp. Form.C27H32ClN9O2S
Mol. Mass.582.12
SMILESCNC(=O)[C@@H]1CSCN1c1nc(Nc2c(C)cccc2C(=O)NC)nc(n1)N1CCN(CC1)c1ccccc1Cl