Reaction Details
TargetRibosyldihydronicotinamide dehydrogenase [quinone]
LigandBDBM92769
Substrate/Competitorn/a
Meas. Tech.Cell Assay
IC50>1.0e+4±n/a nM
Citation Yan, CDufour, MSiegel, DReigan, PGomez, JShieh, BMoody, CJRoss, D Indolequinone inhibitors of NRH:quinone oxidoreductase 2. Characterization of the mechanism of inhibition in both cell-free and cellular systems. Biochemistry50:6678-88 (2011) 
 
Ribosyldihydronicotinamide dehydrogenase [quinone]
Name:Ribosyldihydronicotinamide dehydrogenase [quinone]
Type:Protein
Mol. Mass.:25917.25
Organism:Homo sapiens (Human)
Description:P16083
Residue:231
BDBM92769
NameBDBM92769
Synonyms:Indolequinone, compd 3
TypeSmall molecule
Emp. Form.C21H22F3N3O3
Mol. Mass.421.4129
SMILESCc1c(COc2c(F)cc(F)cc2F)c2c(O)cc(N=CCCCN)c(O)c2n1C