Reaction Details
Target25-hydroxyvitamin D-1 alpha hydroxylase, mitochondrial
LigandBDBM92778
Substrate/Competitorn/a
Meas. Tech.CYP27B1 Inhibition Assay
Ki 68± 11 nM
Citation Zhu, JBarycki, RChiellini, GDeluca, HF Screening of selective inhibitors of 1a,25-dihydroxyvitamin D3 24-hydroxylase using recombinant human enzyme expressed in Escherichia coli. Biochemistry49:10403-11 (2010) 
 
25-hydroxyvitamin D-1 alpha hydroxylase, mitochondrial
Name:25-hydroxyvitamin D-1 alpha hydroxylase, mitochondrial
Type:Protein
Mol. Mass.:56522.50
Organism:Homo sapiens (Human)
Description:O15528
Residue:508
BDBM92778
NameBDBM92778
Synonyms:AB47
TypeSmall molecule
Emp. Form.C24H35BrO3
Mol. Mass.451.437
SMILESC[C@@H](COC(=O)CBr)C1CCC2\C(CCC[C@]12C)=C\C=C1\C[C@H](O)CCC1=C