Reaction Details
TargetCarbon monoxide dehydrogenase small chain
LigandBDBM24776
Substrate/Competitorn/a
Meas. Tech.Inhibition Assay
Kd 1.40e+5±n/a nM
Citation Wilcoxen, JZhang, BHille, R Reaction of the molybdenum- and copper-containing carbon monoxide dehydrogenase from Oligotropha carboxydovorans with quinones. Biochemistry50:1910-6 (2011) 
 
Carbon monoxide dehydrogenase small chain
Name:Carbon monoxide dehydrogenase small chain
Type:Enzyme
Mol. Mass.:17790.76
Organism:Oligotropha carboxidovorans
Description:P19921
Residue:166
BDBM24776
NameBDBM24776
Synonyms:1,4-Naphthoquinone 1,4-dihydronaphthalene-1,4-dione CHEMBL55934
TypeSmall organic molecule
Emp. Form.C10H6O2
Mol. Mass.158.1534
SMILESO=C1C=CC(=O)c2ccccc12