Reaction Details
TargetAurora kinase A
LigandBDBM92807
Substrate/Competitorn/a
Meas. Tech.In Vitro Enzyme Assay
IC50>5.0e+4±n/a nM
Citation Lawrence, HRMartin, MPLuo, YPireddu, RYang, HGevariya, HOzcan, SZhu, JYKendig, RRodriguez, MElias, RCheng, JQSebti, SMSchonbrunn, ELawrence, NJ Development of o-chlorophenyl substituted pyrimidines as exceptionally potent aurora kinase inhibitors. J Med Chem55:7392-416 (2012) 
 
Aurora kinase A
Name:Aurora kinase A
Type:Serine/threonine-protein kinase
Mol. Mass.:45830.98
Organism:Homo sapiens (Human)
Description:O14965
Residue:403
BDBM92807
NameBDBM92807
Synonyms:Bisanilinopyrimidine, 4b | US9249124, 23
TypeSmall molecule
Emp. Form.C18H15N5O4
Mol. Mass.365.3428
SMILESNc1cc(Nc2ccccc2C(O)=O)nc(Nc2ccc(cc2)C(O)=O)n1