Reaction Details
TargetAurora kinase A
LigandBDBM92814
Substrate/Competitorn/a
Meas. Tech.In Vitro Enzyme Assay
IC50 560±70.3 nM
Citation Lawrence, HRMartin, MPLuo, YPireddu, RYang, HGevariya, HOzcan, SZhu, JYKendig, RRodriguez, MElias, RCheng, JQSebti, SMSchonbrunn, ELawrence, NJ Development of o-chlorophenyl substituted pyrimidines as exceptionally potent aurora kinase inhibitors. J Med Chem55:7392-416 (2012) 
 
Aurora kinase A
Name:Aurora kinase A
Type:Serine/threonine-protein kinase
Mol. Mass.:45830.98
Organism:Homo sapiens (Human)
Description:O14965
Residue:403
BDBM92814
NameBDBM92814
Synonyms:Bisanilinopyrimidine, 6g | US9249124, 30
TypeSmall molecule
Emp. Form.C17H13N5
Mol. Mass.287.3186
SMILESN#Cc1ccccc1Nc1ccnc(Nc2ccccc2)n1