Reaction Details
TargetAurora kinase B
LigandBDBM92829
Substrate/Competitorn/a
Meas. Tech.In Vitro Enzyme Assay
IC50 93.9±0 nM
Citation Lawrence, HRMartin, MPLuo, YPireddu, RYang, HGevariya, HOzcan, SZhu, JYKendig, RRodriguez, MElias, RCheng, JQSebti, SMSchonbrunn, ELawrence, NJ Development of o-chlorophenyl substituted pyrimidines as exceptionally potent aurora kinase inhibitors. J Med Chem55:7392-416 (2012) 
 
Aurora kinase B
Name:Aurora kinase B
Type:Protein
Mol. Mass.:39327.72
Organism:Homo sapiens (Human)
Description:Q96GD4
Residue:344
BDBM92829
NameBDBM92829
Synonyms:Bisanilinopyrimidine, 9b | US9249124, 44
TypeSmall molecule
Emp. Form.C21H23ClN6O
Mol. Mass.410.9
SMILESCN(C)CCNC(=O)c1ccc(Nc2nccc(Nc3ccccc3Cl)n2)cc1