Reaction Details
TargetAurora kinase A
LigandBDBM92831
Substrate/Competitorn/a
Meas. Tech.In Vitro Enzyme Assay
IC50 44.9±4.7 nM
Citation Lawrence, HRMartin, MPLuo, YPireddu, RYang, HGevariya, HOzcan, SZhu, JYKendig, RRodriguez, MElias, RCheng, JQSebti, SMSchonbrunn, ELawrence, NJ Development of o-chlorophenyl substituted pyrimidines as exceptionally potent aurora kinase inhibitors. J Med Chem55:7392-416 (2012) 
 
Aurora kinase A
Name:Aurora kinase A
Type:Serine/threonine-protein kinase
Mol. Mass.:45830.98
Organism:Homo sapiens (Human)
Description:O14965
Residue:403
BDBM92831
NameBDBM92831
Synonyms:Bisanilinopyrimidine, 9d | US9249124, 47
TypeSmall molecule
Emp. Form.C17H15ClN4O2S
Mol. Mass.374.845
SMILESCS(=O)(=O)c1ccc(Nc2nccc(Nc3ccccc3Cl)n2)cc1