Reaction Details
TargetAurora kinase A
LigandBDBM92832
Substrate/Competitorn/a
Meas. Tech.In Vitro Enzyme Assay
IC50 71.2±9.0 nM
Citation Lawrence, HRMartin, MPLuo, YPireddu, RYang, HGevariya, HOzcan, SZhu, JYKendig, RRodriguez, MElias, RCheng, JQSebti, SMSchonbrunn, ELawrence, NJ Development of o-chlorophenyl substituted pyrimidines as exceptionally potent aurora kinase inhibitors. J Med Chem55:7392-416 (2012) 
 
Aurora kinase A
Name:Aurora kinase A
Type:Serine/threonine-protein kinase
Mol. Mass.:45830.98
Organism:Homo sapiens (Human)
Description:O14965
Residue:403
BDBM92832
NameBDBM92832
Synonyms:Bisanilinopyrimidine, 9e
TypeSmall molecule
Emp. Form.C18H16ClN5O
Mol. Mass.353.806
SMILESCC(=O)Nc1cccc(Nc2nccc(Nc3ccccc3Cl)n2)c1