Reaction Details
TargetAurora kinase A
LigandBDBM92834
Substrate/Competitorn/a
Meas. Tech.In Vitro Enzyme Assay
IC50 116.5±10.6 nM
Citation Lawrence, HRMartin, MPLuo, YPireddu, RYang, HGevariya, HOzcan, SZhu, JYKendig, RRodriguez, MElias, RCheng, JQSebti, SMSchonbrunn, ELawrence, NJ Development of o-chlorophenyl substituted pyrimidines as exceptionally potent aurora kinase inhibitors. J Med Chem55:7392-416 (2012) 
 
Aurora kinase A
Name:Aurora kinase A
Type:Serine/threonine-protein kinase
Mol. Mass.:45830.98
Organism:Homo sapiens (Human)
Description:O14965
Residue:403
BDBM92834
NameBDBM92834
Synonyms:Bisanilinopyrimidine, 9g | US9249124, 50
TypeSmall molecule
Emp. Form.C18H15ClN4O3
Mol. Mass.370.79
SMILESCOc1cc(Nc2nccc(Nc3ccccc3Cl)n2)ccc1C(O)=O