Reaction Details
TargetAurora kinase B
LigandBDBM92840
Substrate/Competitorn/a
Meas. Tech.In Vitro Enzyme Assay
IC50 40.4±0 nM
Citation Lawrence, HRMartin, MPLuo, YPireddu, RYang, HGevariya, HOzcan, SZhu, JYKendig, RRodriguez, MElias, RCheng, JQSebti, SMSchonbrunn, ELawrence, NJ Development of o-chlorophenyl substituted pyrimidines as exceptionally potent aurora kinase inhibitors. J Med Chem55:7392-416 (2012) 
 
Aurora kinase B
Name:Aurora kinase B
Type:Protein
Mol. Mass.:39327.72
Organism:Homo sapiens (Human)
Description:Q96GD4
Residue:344
BDBM92840
NameBDBM92840
Synonyms:Bisanilinopyrimidine, 9l | US9249124, 56
TypeSmall molecule
Emp. Form.C19H18ClN5O2
Mol. Mass.383.832
SMILESOCCNC(=O)c1ccc(Nc2nccc(Nc3ccccc3Cl)n2)cc1