Reaction Details
TargetNociceptin receptor
LigandBDBM82083
Substrate/Competitorn/a
Ki 192±n/a nM
CommentsPDSP_273
Citation Mogil, JSPasternak, GW The molecular and behavioral pharmacology of the orphanin FQ/nociceptin peptide and receptor family. Pharmacol Rev53:381-415 (2001) Nociceptin receptor
Name:Nociceptin receptor
Type:Enzyme Catalytic Domain
Mol. Mass.:40499.09
Organism:MOUSE
Description:Nociceptin/Orphanin FQ, NOP receptor 0 MOUSE::P35377
Residue:367
BDBM82083
NameBDBM82083
Synonyms:Alpha-Neoendorphin CB0427223
TypeSmall organic molecule
Emp. Form.C60H89N15O13
Mol. Mass.1228.4414
SMILES[#6]-[#6](-[#6])-[#6]-[#6@H](-[#7]-[#6](=O)-[#6@H](-[#6]-c1ccccc1)-[#7]-[#6](=O)-[#6]-[#7]-[#6](=O)-[#6]-[#7]-[#6](=O)-[#6@@H](-[#7])-[#6]-c1ccc(-[#8])cc1)-[#6](=O)-[#7]-[#6@@H](-[#6]-[#6]-[#6]\[#7]=[#6](/[#7])-[#7])-[#6](=O)-[#7]-[#6@@H](-[#6]-[#6]-[#6]-[#6]-[#7])-[#6](=O)-[#7]-[#6@@H](-[#6]-c1ccc(-[#8])cc1)-[#6](=O)-[#7]-1-[#6]-[#6]-[#6]-[#6@H]-1-[#6](=O)-[#7]-[#6@@H](-[#6]-[#6]-[#6]-[#6]-[#7])-[#6](-[#8])=O