Reaction Details
TargetNociceptin receptor
LigandBDBM50018731
Substrate/Competitorn/a
Ki 7500±n/a nM
CommentsPDSP_601
Citation Mogil, JSPasternak, GW The molecular and behavioral pharmacology of the orphanin FQ/nociceptin peptide and receptor family. Pharmacol Rev53:381-415 (2001) Nociceptin receptor
Name:Nociceptin receptor
Type:Enzyme Catalytic Domain
Mol. Mass.:40499.09
Organism:MOUSE
Description:Nociceptin/Orphanin FQ, NOP receptor 0 MOUSE::P35377
Residue:367
BDBM50018731
NameBDBM50018731
Synonyms:(Cyclazocine) 3-Cyclopropylmethyl-6,11-dimethyl-1,2,3,4,5,6-hexahydro-2,6-methano-benzo[d]azocin-8-ol 10-cyclopropylmethyl-1,13-dimethyl-10-azatricyclo[7.3.1.02,7]trideca-2(7),3,5-trien-4-ol(Cyclazocine) 3-Cyclopropylmethyl-6,11-dimethyl-1,2,3,4,5,6-hexahydro-2,6-methano-benzo[d]azocin-8-ol(Cyclazocine) CYCLAZOCINE (-) | Cyclazocine (+)
TypeSmall organic molecule
Emp. Form.C18H25NO
Mol. Mass.271.3972
SMILESCC1C2Cc3ccc(O)cc3C1(C)CCN2CC1CC1