Reaction Details
TargetNociceptin receptor
LigandBDBM50010702
Substrate/Competitorn/a
Ki 72.8±n/a nM
CommentsPDSP_766
Citation Mogil, JSPasternak, GW The molecular and behavioral pharmacology of the orphanin FQ/nociceptin peptide and receptor family. Pharmacol Rev53:381-415 (2001) Nociceptin receptor
Name:Nociceptin receptor
Type:Enzyme Catalytic Domain
Mol. Mass.:40499.09
Organism:MOUSE
Description:Nociceptin/Orphanin FQ, NOP receptor 0 MOUSE::P35377
Residue:367
BDBM50010702
NameBDBM50010702
Synonyms:CHEMBL411557 Dynorphin A (1-17) Tyr-Gly-Gly-Phe-Leu-Arg-Arg-Ile-Arg-Pro-Lys-Leu-Lys-Trp-Asp-Asn-Gln | dynorphin A
TypeSmall organic molecule
Emp. Form.C99H155N31O23
Mol. Mass.2147.4839
SMILESCC[C@H](C)[C@H](NC(=O)[C@H](CCCN=C(N)N)NC(=O)[C@H](CCCNC(N)=N)NC(=O)[C@H](CC(C)C)NC(=O)[C@H](Cc1ccccc1)NC(=O)CNC(=O)CNC(=O)[C@@H](N)Cc1ccc(O)cc1)C(=O)N[C@@H](CCCN=C(N)N)C(=O)N1CCC[C@H]1C(=O)N[C@@H](CCCCN)C(=O)N[C@@H](CC(C)C)C(=O)N[C@@H](CCCCN)C(=O)N[C@@H](Cc1c[nH]c2ccccc12)C(=O)N[C@@H](CC(O)=O)C(=O)N[C@@H](CC(N)=O)C(=O)N[C@@H](CCC(N)=O)C(O)=O