Reaction Details
TargetNociceptin receptor
LigandBDBM81935
Substrate/Competitorn/a
Ki 898±n/a nM
CommentsPDSP_1351
Citation Mogil, JSPasternak, GW The molecular and behavioral pharmacology of the orphanin FQ/nociceptin peptide and receptor family. Pharmacol Rev53:381-415 (2001) Nociceptin receptor
Name:Nociceptin receptor
Type:Enzyme Catalytic Domain
Mol. Mass.:40499.09
Organism:MOUSE
Description:Nociceptin/Orphanin FQ, NOP receptor 0 MOUSE::P35377
Residue:367
BDBM81935
NameBDBM81935
Synonyms:CAS_105618-26-6 Nor-BNI
TypeSmall organic molecule
Emp. Form.C40H43N3O6
Mol. Mass.661.7859
SMILESOc1ccc2CC(C3CC3)N3CCC45C(Oc1c24)c1[nH]c2C4Oc6c7c(CC(C8CC8)N8CCC47C(O)(C8)Cc2c1CC5(O)C3)ccc6O