Reaction Details
TargetNitric oxide synthase, brain
LigandBDBM50341682
Substrate/Competitorn/a
Meas. Tech.Inhibitory Assay
Ki 25±0.0 nM
Citation Delker, SLXue, FLi, HJamal, JSilverman, RBPoulos, TL Role of zinc in isoform-selective inhibitor binding to neuronal nitric oxide synthase . Biochemistry49:10803-10 (2010) 
 
Nitric oxide synthase, brain
Name:Nitric oxide synthase, brain
Type:Homodimer
Mol. Mass.:160985.98
Organism:Homo sapiens (Human)
Description:P29475
Residue:1434
BDBM50341682
NameBDBM50341682
Synonyms:6,6'-(2,2'-(Pyridine-3,5-diyl)bis(ethane-2,1-diyl))bis(4methylpyridin-2-amine) CHEMBL1615288 US10759791, Compound 2a | US9951014, Name 2a
TypeSmall organic molecule
Emp. Form.C21H25N5
Mol. Mass.347.4567
SMILESCc1cc(N)nc(CCc2cncc(CCc3cc(C)cc(N)n3)c2)c1