Reaction Details
TargetNitric oxide synthase, inducible
LigandBDBM50341684
Substrate/Competitorn/a
Meas. Tech.Inhibitory Assay
Ki 2730±0.0 nM
Citation Delker, SLXue, FLi, HJamal, JSilverman, RBPoulos, TL Role of zinc in isoform-selective inhibitor binding to neuronal nitric oxide synthase . Biochemistry49:10803-10 (2010) 
 
Nitric oxide synthase, inducible
Name:Nitric oxide synthase, inducible
Type:Homodimer
Mol. Mass.:131141.95
Organism:Homo sapiens (Human)
Description:P35228
Residue:1153
BDBM50341684
NameBDBM50341684
Synonyms:6,6'-(2,2'-(1,3-Phenylene)bis(ethane-2,1-diyl))bis(4-methylpyridin-2-amine) NOS Inhibitor, 3h US9951014, Name 31a
TypeSmall organic molecule
Emp. Form.C22H26N4
Mol. Mass.346.4686
SMILESCc1cc(N)nc(CCc2cccc(CCc3cc(C)cc(N)n3)c2)c1