Reaction Details
TargetPyrazinamidase/nicotinamidase, PncA protein
LigandBDBM92853
Substrate/Competitorn/a
Meas. Tech.GDH-Coupled Nicotinamidase Assay
Ki 370000±0 nM
Citation French, JBCen, YVrablik, TLXu, PAllen, EHanna-Rose, WSauve, AA Characterization of nicotinamidases: steady state kinetic parameters, classwide inhibition by nicotinaldehydes, and catalytic mechanism. Biochemistry49:10421-39 (2010) 
 
Pyrazinamidase/nicotinamidase, PncA protein
Name:Pyrazinamidase/nicotinamidase, PncA protein
Type:Enzyme
Mol. Mass.:19332.49
Organism:Borrelia burgdorferi
Description:O50718
Residue:167
BDBM92853
NameBDBM92853
Synonyms:Nicotinamidase Inhibitor, 20
TypeSmall molecule
Emp. Form.C6H4ClNO
Mol. Mass.141.555
SMILESClc1ncccc1C=O