Reaction Details
TargetPyrazinamidase/nicotinamidase, PncA protein
LigandBDBM92857
Substrate/Competitorn/a
Meas. Tech.GDH-Coupled Nicotinamidase Assay
Ki 342000±0 nM
Citation French, JBCen, YVrablik, TLXu, PAllen, EHanna-Rose, WSauve, AA Characterization of nicotinamidases: steady state kinetic parameters, classwide inhibition by nicotinaldehydes, and catalytic mechanism. Biochemistry49:10421-39 (2010) 
 
Pyrazinamidase/nicotinamidase, PncA protein
Name:Pyrazinamidase/nicotinamidase, PncA protein
Type:Enzyme
Mol. Mass.:19332.49
Organism:Borrelia burgdorferi
Description:O50718
Residue:167
BDBM92857
NameBDBM92857
Synonyms:Nicotinamidase Inhibitor, 24
TypeSmall molecule
Emp. Form.C7H7NO
Mol. Mass.121.1366
SMILESCC(=O)c1cccnc1