Reaction Details
TargetIsochorismatase family protein
LigandBDBM92854
Substrate/Competitorn/a
Meas. Tech.GDH-Coupled Nicotinamidase Assay
Ki 730±290 nM
Citation French, JBCen, YVrablik, TLXu, PAllen, EHanna-Rose, WSauve, AA Characterization of nicotinamidases: steady state kinetic parameters, classwide inhibition by nicotinaldehydes, and catalytic mechanism. Biochemistry49:10421-39 (2010) 
 
Isochorismatase family protein
Name:Isochorismatase family protein
Type:Enzyme
Mol. Mass.:21361.69
Organism:Streptococcus pneumoniae
Description:A0A098ZGI7
Residue:191
BDBM92854
NameBDBM92854
Synonyms:Nicotinamidase Inhibitor, 21
TypeSmall molecule
Emp. Form.C6H4FNO
Mol. Mass.125.1005
SMILESFc1ccc(C=O)cn1