Reaction Details
TargetIsochorismatase family protein
LigandBDBM23515
Substrate/Competitorn/a
Meas. Tech.GDH-Coupled Nicotinamidase Assay
Ki 2000000±0 nM
Citation French, JBCen, YVrablik, TLXu, PAllen, EHanna-Rose, WSauve, AA Characterization of nicotinamidases: steady state kinetic parameters, classwide inhibition by nicotinaldehydes, and catalytic mechanism. Biochemistry49:10421-39 (2010) 
 
Isochorismatase family protein
Name:Isochorismatase family protein
Type:Enzyme
Mol. Mass.:21361.69
Organism:Streptococcus pneumoniae
Description:A0A098ZGI7
Residue:191
BDBM23515
NameBDBM23515
Synonyms:CHEMBL573 Nicotinic Acid pyridine-3-carboxylic acid | wampocap
TypeSmall organic molecule
Emp. Form.C6H5NO2
Mol. Mass.123.1094
SMILESOC(=O)c1cccnc1