Reaction Details
TargetIsochorismatase domain-containing protein
LigandBDBM92851
Substrate/Competitorn/a
Meas. Tech.GDH-Coupled Nicotinamidase Assay
Ki 140±20 nM
Citation French, JBCen, YVrablik, TLXu, PAllen, EHanna-Rose, WSauve, AA Characterization of nicotinamidases: steady state kinetic parameters, classwide inhibition by nicotinaldehydes, and catalytic mechanism. Biochemistry49:10421-39 (2010) 
 
Isochorismatase domain-containing protein
Name:Isochorismatase domain-containing protein
Synonyms:Nicotinamidase (CePNC2)
Type:Enzyme
Mol. Mass.:36083.31
Organism:Caenorhabditis elegans
Description:Q7YTI0
Residue:316
BDBM92851
NameBDBM92851
Synonyms:Nicotinamidase Inhibitor, 18
TypeSmall molecule
Emp. Form.C7H7NO2
Mol. Mass.137.136
SMILESCOc1cncc(C=O)c1