Reaction Details
TargetSerine/threonine-protein kinase mTOR
LigandBDBM92862
Substrate/Competitorn/a
Meas. Tech.Radiometric Filtration Assay
Ki 2.5±0.2 nM
IC50 9.6±0.9 nM
Citation Tao, ZBarker, JShi, SDGehring, MSun, S Steady-state kinetic and inhibition studies of the mammalian target of rapamycin (mTOR) kinase domain and mTOR complexes. Biochemistry49:8488-98 (2010) 
 
Serine/threonine-protein kinase mTOR
Name:Serine/threonine-protein kinase mTOR
Type:Rapamycin target protein
Mol. Mass.:288917.12
Organism:Homo sapiens (Human)
Description:P42345
Residue:2549
BDBM92862
NameBDBM92862
Synonyms:US9284315, BEZ-235 | mTOR Inhibitor, BEZ235
TypeSmall molecule
Emp. Form.C30H23N5O
Mol. Mass.469.5365
SMILESCn1c2cnc3ccc(cc3c2n(-c2ccc(cc2)C(C)(C)C#N)c1=O)-c1cnc2ccccc2c1