Reaction Details
TargetSerine/threonine-protein kinase mTOR
LigandBDBM92863
Substrate/Competitorn/a
Meas. Tech.Radiometric Filtration Assay
IC50 9.6±1.0 nM
Citation Tao, ZBarker, JShi, SDGehring, MSun, S Steady-state kinetic and inhibition studies of the mammalian target of rapamycin (mTOR) kinase domain and mTOR complexes. Biochemistry49:8488-98 (2010) 
 
Serine/threonine-protein kinase mTOR
Name:Serine/threonine-protein kinase mTOR
Type:Rapamycin target protein
Mol. Mass.:288917.12
Organism:Homo sapiens (Human)
Description:P42345
Residue:2549
BDBM92863
NameBDBM92863
Synonyms:US9505773, Rapamycin | mTOR Inhibitor, Rapamycin
TypeOrganic molecule
Emp. Form.C51H79NO13
Mol. Mass.914.1719
SMILESCO[C@@H]1C[C@H](C[C@@H](C)[C@@H]2CC(=O)[C@H](C)\C=C(C)\[C@@H](O)[C@@H](OC)C(=O)[C@H](C)C[C@H](C)\C=C/C=C/C=C(C)/[C@H](C[C@@H]3CC[C@@H](C)[C@@](O)(O3)C(=O)C(=O)N3CCCC[C@H]3C(=O)O2)OC)CC[C@H]1O