Reaction Details
TargetKinesin-like protein KIF11
LigandBDBM50293756
Substrate/Competitorn/a
Meas. Tech.Binding Assay
Kd 2e+3±n/a nM
Citation Sheth, PRShipps, GWSeghezzi, WSmith, CKChuang, CCSanden, DBasso, ADVilenchik, LGray, KAnnis, DANickbarg, EMa, YLahue, BHerbst, RLe, HV Novel benzimidazole inhibitors bind to a unique site in the kinesin spindle protein motor domain. Biochemistry49:8350-8 (2010) 
 
Kinesin-like protein KIF11
Name:Kinesin-like protein KIF11
Type:PROTEIN
Mol. Mass.:119138.97
Organism:Homo sapiens (Human)
Description:ChEMBL_1457426
Residue:1056
BDBM50293756
NameBDBM50293756
Synonyms:2-(4-(methylthio)phenylamino)-1-(2-(trifluoromethyl)benzyl)-1H-benzo[d]imidazole-5-carboxamide KSP Inhibitor, 4a
TypeSmall organic molecule
Emp. Form.C23H19F3N4OS
Mol. Mass.456.483
SMILESCSc1ccc(Nc2nc3cc(ccc3n2Cc2ccccc2C(F)(F)F)C(N)=O)cc1