Reaction Details
TargetKinesin-like protein KIF11
LigandBDBM50293753
Substrate/Competitorn/a
Meas. Tech.Binding Assay
Kd 2.5e+3±n/a nM
Citation Sheth, PRShipps, GWSeghezzi, WSmith, CKChuang, CCSanden, DBasso, ADVilenchik, LGray, KAnnis, DANickbarg, EMa, YLahue, BHerbst, RLe, HV Novel benzimidazole inhibitors bind to a unique site in the kinesin spindle protein motor domain. Biochemistry49:8350-8 (2010) 
 
Kinesin-like protein KIF11
Name:Kinesin-like protein KIF11
Type:PROTEIN
Mol. Mass.:119138.97
Organism:Homo sapiens (Human)
Description:ChEMBL_1457426
Residue:1056
BDBM50293753
NameBDBM50293753
Synonyms:2-(4-(methylsulfonyl)phenylamino)-1-(2-(trifluoromethyl)benzyl)-1H-benzo[d]imidazole-5-carboxamide KSP Inhibitor, 4b
TypeSmall organic molecule
Emp. Form.C23H19F3N4O3S
Mol. Mass.488.482
SMILESCS(=O)(=O)c1ccc(Nc2nc3cc(ccc3n2Cc2ccccc2C(F)(F)F)C(N)=O)cc1