Reaction Details
TargetKinesin-like protein KIF11
LigandBDBM92865
Substrate/Competitorn/a
Meas. Tech.Binding Assay
Kd 5e+3±n/a nM
Citation Sheth, PRShipps, GWSeghezzi, WSmith, CKChuang, CCSanden, DBasso, ADVilenchik, LGray, KAnnis, DANickbarg, EMa, YLahue, BHerbst, RLe, HV Novel benzimidazole inhibitors bind to a unique site in the kinesin spindle protein motor domain. Biochemistry49:8350-8 (2010) 
 
Kinesin-like protein KIF11
Name:Kinesin-like protein KIF11
Type:PROTEIN
Mol. Mass.:119138.97
Organism:Homo sapiens (Human)
Description:ChEMBL_1457426
Residue:1056
BDBM92865
NameBDBM92865
Synonyms:KSP Inhibitor, 4d
TypeSmall molecule
Emp. Form.C23H21N3O4
Mol. Mass.403.4305
SMILESCOc1ccc(Nc2nc3cc(ccc3n2Cc2ccccc2OC)C(O)=O)cc1