Reaction Details
TargetAurora kinase A
LigandBDBM92867
Substrate/Competitorn/a
Meas. Tech.Aurora Kinase Assay
IC50 179±0.0 nM
Citation Zheng, MZheng, YXue, YLiu, YAn, LZhang, LJi, MXue, BWu, XGong, XGu, NZhan, X Synthesis and Quantum Chemical Studies of New 4-aminoquinazoline Derivatives as Aurora A/B Kinase Inhibitors. Chem Biol Drug Des81:399-407 (2013) 
 
Aurora kinase A
Name:Aurora kinase A
Type:Serine/threonine-protein kinase
Mol. Mass.:45830.98
Organism:Homo sapiens (Human)
Description:O14965
Residue:403
BDBM92867
NameBDBM92867
Synonyms:4-Aminoquinazoline derivative, 6a
TypeSmall molecule
Emp. Form.C31H32N8O2
Mol. Mass.548.6382
SMILESCc1ccc(Nc2ncnc3cc(OCCCN4CCOCC4)ccc23)cc1Nc1ncc(cn1)-c1cccnc1