Reaction Details
TargetAurora kinase A
LigandBDBM92871
Substrate/Competitorn/a
Meas. Tech.Aurora Kinase Assay
IC50 111±0.0 nM
Citation Zheng, MZheng, YXue, YLiu, YAn, LZhang, LJi, MXue, BWu, XGong, XGu, NZhan, X Synthesis and Quantum Chemical Studies of New 4-aminoquinazoline Derivatives as Aurora A/B Kinase Inhibitors. Chem Biol Drug Des81:399-407 (2013) 
 
Aurora kinase A
Name:Aurora kinase A
Type:Serine/threonine-protein kinase
Mol. Mass.:45830.98
Organism:Homo sapiens (Human)
Description:O14965
Residue:403
BDBM92871
NameBDBM92871
Synonyms:4-Aminoquinazoline derivative, 6f
TypeSmall molecule
Emp. Form.C27H31N5O3S
Mol. Mass.505.632
SMILESCCOC(=O)c1csc2cc(Nc3ncnc4cc(OCCCN5CCN(C)CC5)ccc34)ccc12