Reaction Details
TargetAurora kinase A
LigandBDBM92873
Substrate/Competitorn/a
Meas. Tech.Aurora Kinase Assay
IC50 62±0.0 nM
Citation Zheng, MZheng, YXue, YLiu, YAn, LZhang, LJi, MXue, BWu, XGong, XGu, NZhan, X Synthesis and Quantum Chemical Studies of New 4-aminoquinazoline Derivatives as Aurora A/B Kinase Inhibitors. Chem Biol Drug Des81:399-407 (2013) 
 
Aurora kinase A
Name:Aurora kinase A
Type:Serine/threonine-protein kinase
Mol. Mass.:45830.98
Organism:Homo sapiens (Human)
Description:O14965
Residue:403
BDBM92873
NameBDBM92873
Synonyms:4-Aminoquinazoline derivative, 6h
TypeSmall molecule
Emp. Form.C26H28N4O3S
Mol. Mass.476.591
SMILESCCOC(=O)c1csc2cc(Nc3ncnc4cc(OCCCN5CCCC5)ccc34)ccc12