Reaction Details
TargetAcetylcholine-binding protein
LigandBDBM50143314
Substrate/Competitorn/a
Meas. Tech.Interaction Assay
pH7.4±0
Temperature298.15±0 K
Kd 2.67±1.34 nM
Citation Geitmann, MRetra, Kde Kloe, GEHoman, ESmit, ABde Esch, IJDanielson, UH Interaction kinetic and structural dynamic analysis of ligand binding to acetylcholine-binding protein. Biochemistry49:8143-54 (2010) 
 
Acetylcholine-binding protein
Name:Acetylcholine-binding protein
Type:n/a
Mol. Mass.:26055.52
Organism:Lymnaea stagnalis
Description:Soluble acetylcholine receptor
Residue:229
BDBM50143314
NameBDBM50143314
Synonyms:(+)-Epibatidine (1R,2R,4S)-2-(6-Chloro-pyridin-3-yl)-7-aza-bicyclo[2.2.1]heptane CHEMBL298826 | EPIBATIDINE
TypeSmall organic molecule
Emp. Form.C11H13ClN2
Mol. Mass.208.687
SMILESClc1ccc(cn1)[C@H]1C[C@@H]2CC[C@H]1N2