Reaction Details
TargetLysine-specific histone demethylase 1A
LigandBDBM50346585
Substrate/Competitorn/a
Meas. Tech.LSD1 Inhibition Assay
IC50 9.9e+2±n/a nM
Citation Mimasu, SUmezawa, NSato, SHiguchi, TUmehara, TYokoyama, S Structurally designed trans-2-phenylcyclopropylamine derivatives potently inhibit histone demethylase LSD1/KDM1 . Biochemistry49:6494-503 (2010) 
 
Lysine-specific histone demethylase 1A
Name:Lysine-specific histone demethylase 1A
Type:Enzyme
Mol. Mass.:92901.01
Organism:Homo sapiens (Human)
Description:O60341
Residue:852
BDBM50346585
NameBDBM50346585
Synonyms:CHEMBL1795980 | S2101
TypeSmall organic molecule
Emp. Form.C16H15F2NO
Mol. Mass.275.2932
SMILESNC1CC1c1cc(F)cc(F)c1OCc1ccccc1