Reaction Details
TargetGenome polyprotein
LigandBDBM92891
Substrate/Competitorn/a
Meas. Tech.Competitive Inhibition Assay
Ki 180±58 nM
Citation Dahl, GArenas, OGDanielson, UH Hepatitis C virus NS3 protease is activated by low concentrations of protease inhibitors. Biochemistry48:11592-602 (2009) 
 
Genome polyprotein
Name:Genome polyprotein
Synonyms:NS3 protein
Type:Protein
Mol. Mass.:45665.89
Organism:Hepatitis C virus
Description:Q04045
Residue:428
BDBM92891
NameBDBM92891
Synonyms:NS3 Protease Inhibitor, 2
TypeSmall molecule
Emp. Form.C33H42N4O10S
Mol. Mass.686.772
SMILESOC(=O)CC[C@H](NC(=O)[C@@H](NC(=O)CCC(O)=O)C1CCCCC1)C(=O)N[C@@H](Cc1ccc2ccccc2c1)C(=O)N[C@@H](CS)C(O)=O