Reaction Details
TargetGenome polyprotein
LigandBDBM92895
Substrate/Competitorn/a
Meas. Tech.Competitive Inhibition Assay
Ki 1100±260 nM
Citation Dahl, GArenas, OGDanielson, UH Hepatitis C virus NS3 protease is activated by low concentrations of protease inhibitors. Biochemistry48:11592-602 (2009) 
 
Genome polyprotein
Name:Genome polyprotein
Synonyms:NS3 protein
Type:Protein
Mol. Mass.:45665.89
Organism:Hepatitis C virus
Description:Q04045
Residue:428
BDBM92895
NameBDBM92895
Synonyms:NS3 Protease Inhibitor, 6
TypeSmall molecule
Emp. Form.C35H42N4O8
Mol. Mass.646.73
SMILESCOc1ccc2c(O[C@@H]3C[C@H](N(C3)C(=O)[C@@H](NC(=O)OC(C)(C)C)C(C)C)C(=O)NC3(CC3)C(O)=O)cc(nc2c1)-c1ccccc1