Reaction Details
TargetGenome polyprotein
LigandBDBM92896
Substrate/Competitorn/a
Meas. Tech.Competitive Inhibition Assay
Ki 290±100 nM
Citation Dahl, GArenas, OGDanielson, UH Hepatitis C virus NS3 protease is activated by low concentrations of protease inhibitors. Biochemistry48:11592-602 (2009) 
 
Genome polyprotein
Name:Genome polyprotein
Synonyms:NS3 protein
Type:Protein
Mol. Mass.:45665.89
Organism:Hepatitis C virus
Description:Q04045
Residue:428
BDBM92896
NameBDBM92896
Synonyms:NS3 Protease Inhibitor, 7
TypeSmall molecule
Emp. Form.C46H49N5O9S
Mol. Mass.847.974
SMILESCOc1ccc2c(Oc3ccc(cc3)[C@H](NC(=O)C(NC(=O)OC(C)(C)C)C(C)C)C(=O)N[C@@]3(CC3C=C)C(=O)NS(=O)(=O)c3ccccc3)cc(nc2c1)-c1ccccc1