Reaction Details
TargetNitric oxide synthase, brain
LigandBDBM50138983
Substrate/Competitorn/a
Meas. Tech.Inhibition Assay
Ki 5e+1± 1e+1 nM
Citation Wang, YMonzingo, AFHu, SSchaller, THRobertus, JDFast, W Developing dual and specific inhibitors of dimethylarginine dimethylaminohydrolase-1 and nitric oxide synthase: toward a targeted polypharmacology to control nitric oxide. Biochemistry48:8624-35 (2009) 
 
Nitric oxide synthase, brain
Name:Nitric oxide synthase, brain
Type:Enzyme
Mol. Mass.:160570.98
Organism:Rattus norvegicus (rat)
Description:Recombinant nNOS overexpressed in E. coli was used in enzyme assays.
Residue:1429
BDBM50138983
NameBDBM50138983
Synonyms:(S)-2-Amino-5-(2-methyl-isothioureido)-pentanoic acid 2-Amino-5-(2-methyl-isothioureido)-pentanoic acid N~5~-[(E)-imino(methylsulfanyl)methyl]-L-ornithine SMTC, 5
TypeSmall organic molecule
Emp. Form.C7H15N3O2S
Mol. Mass.205.278
SMILESCSC(N)=NCCC[C@H](N)C(O)=O